{"text_format":"1","workbook":"xlsx","n_sheets":4,"sheets":["Sheet1","ref","temp","dif"],"not_rendered":{"charts":13,"images":0,"macros":1,"external_links":0,"defined_names":0,"comments":0,"pivot_tables":0},"unopened":[],"bounds":{"document_bytes":16777216,"sheet_cells":100000,"rows_first":2000,"rows_last":500,"rows_between":2000,"halvings":0,"cell_chars":16384,"cell_head_chars":4096},"cells_cut":0,"cells_raw":0,"read":"whole","date_system":"1900"}

{"sheet":"Sheet1","index":0,"n_rows":47,"n_cols":23,"rows_kept":47,"cut":false,"hidden":false,"merged":[[30,0,36,0],[0,4,0,22],[1,5,1,8],[1,10,1,11],[2,22,13,22],[4,0,25,0],[1,12,1,13],[1,14,1,15],[1,16,1,19],[1,20,1,21]]}
[null,"D:\\N10\\5座\\5座计算0328-2\\5座计算0403 - 减墙加端柱 -加标准层\\设计结果",null,null,"YJK结构整体参数速校表 — design by 林霄云 2018.3.31"]
[null,"wmass.out",null,null,"9.质量比","3.刚度比",null,null,null,"6.刚重比","4.受剪承载力比",null,"2.周期比",null,"7.剪重比",null,"5.位移角",null,null,null,"1.位移比",null,"8.轴压比"]
[null,null,null,null,null,null,null,null,null,null,null,null,null,null,null,null,null,null,null,null,null,null,"自\n\n行\n\n查\n\n校"]
[null,null,null,null,null,null,null,"X方向最小刚度比:","Y方向最小刚度比:",null,null,null,null,null,"X向楼层最小剪重比","Y向楼层最小剪重比"]
["说明：\n点击生成按钮，将自动更新非填充区数据，及简易图表，以便于快速查阅。切换目录仅需删除B1单元格数据，注意不要修改工作表名",null,null,null,null,null,null,"1.0000(3层1塔)","1.0000(3层1塔)",null,null,null,null,null,1.6E-2,1.6E-2,"  X向最大层间位移角：  1/2161  (15层1塔)","  Y向最大层间位移角：  1/1373  (39层1塔)","  X向最大层间位移角：  1/2374  (39层1塔)","  Y向最大层间位移角：  1/760  (39层1塔)"]
[null,"层号","层高(m)","单位面积质量","g[i]","Ratx1=","Raty1=","Ratx2=","Raty2=","X向刚重比 EJd/GH**2= 7.127","Ratio_X","Ratio_Y","周期","平动系数(X+Y)","X 向剪重比","Y 向剪重比","X方向地震层间位移角","Y方向地震层间位移角","+X 方向风荷载层间位移角","+Y 方向风荷载层间位移角","X方向位移比","Y方向位移比"]
[null,39,4.3499999999999996,1305.83,0.6,1,1,1,1,"Y向刚重比 EJd/GH**2= 4.798",1,1,3.0604,"1.00(0.00+1.00)",8.4400000000000003E-2,0.13300000000000001,{"$f":"1/2664","v":3.7537537537537537E-4},{"$f":"1/1373","v":7.2833211944646763E-4},{"$f":"1/2374","v":4.2122999157540015E-4},{"$f":"1/760","v":1.3157894736842105E-3},1.19,1.03]
[null,38,3.3,2173.0300000000002,1.66,5.9820000000000002,5.2378999999999998,3.5295999999999998,3.0905999999999998,"该结构刚重比EJd/GH**2大于1.4，能够通过《高规》5.4.4条的整体稳定验算",1.75,4.8499999999999996,2.4392,"0.91(0.91+0.00)",5.9799999999999999E-2,8.2839999999999997E-2,{"$f":"1/2759","v":3.6245016310257339E-4},{"$f":"1/1409","v":7.0972320794889996E-4},{"$f":"1/3470","v":2.8818443804034583E-4},{"$f":"1/813","v":1.2300123001230013E-3},1.1599999999999999,1.1000000000000001]
[null,37,3.15,1800.75,1,2.2336999999999998,2.1120999999999999,1.6583000000000001,1.5681,"该结构刚重比EJd/GH**2大于2.7，满足《高规》5.4.1，可以不考虑重力二阶效应",1.41,1.02,1.3130999999999999,"0.09(0.09+0.00)",5.2839999999999998E-2,7.2230000000000003E-2,{"$f":"1/2880","v":3.4722222222222224E-4},{"$f":"1/1411","v":7.0871722182849046E-4},{"$f":"1/3618","v":2.7639579878385847E-4},{"$f":"1/816","v":1.2254901960784314E-3},1.21,1.07]
[null,36,3.15,1800.1,1,1.6964999999999999,1.7351000000000001,1.3194999999999999,1.3494999999999999,null,1.02,1.02,0.70879999999999999,"0.88(0.88+0.00)",4.7359999999999999E-2,6.386E-2,{"$f":"1/2805","v":3.5650623885918003E-4},{"$f":"1/1405","v":7.1174377224199293E-4},{"$f":"1/3545","v":2.8208744710860365E-4},{"$f":"1/815","v":1.2269938650306749E-3}]
[null,35,3.15,1800.1,1,1.5905,1.6141000000000001,1.2371000000000001,1.2554000000000001,null,1.02,1.02,0.62560000000000004,"1.00(0.00+1.00)",4.2779999999999999E-2,5.6809999999999999E-2,{"$f":"1/2719","v":3.677822728944465E-4},{"$f":"1/1400","v":7.1428571428571429E-4},{"$f":"1/3462","v":2.8885037550548814E-4},{"$f":"1/813","v":1.2300123001230013E-3}]
[null,34,3.15,1800.1,1,1.5239,1.5535000000000001,1.1986000000000001,1.2081999999999999,null,1.02,1.02,"X向平动振型参与质量系数总计:",0.94769999999999999,3.9039999999999998E-2,5.0939999999999999E-2,{"$f":"1/2633","v":3.7979491074819596E-4},{"$f":"1/1396","v":7.1633237822349568E-4},{"$f":"1/3369","v":2.9682398337785694E-4},{"$f":"1/812","v":1.2315270935960591E-3}]
[null,33,3.15,1800.1,1,1.4434,1.4618,1.1801999999999999,1.1839999999999999,null,1.02,1.02,"Y向平动振型参与质量系数总计:",0.95430000000000004,3.6150000000000002E-2,4.614E-2,{"$f":"1/2554","v":3.9154267815191856E-4},{"$f":"1/1394","v":7.173601147776184E-4},{"$f":"1/3275","v":3.0534351145038169E-4},{"$f":"1/811","v":1.2330456226880395E-3}]
[null,32,3.15,1800.1,1,1.4039999999999999,1.4096,1.1708000000000001,1.1700999999999999,null,1.02,1.02,"第1扭转周期(1.3131)/第1平动周期(3.0604)",0.43,3.3989999999999999E-2,4.2200000000000001E-2,{"$f":"1/2484","v":4.0257648953301127E-4},{"$f":"1/1393","v":7.1787508973438624E-4},{"$f":"1/3184","v":3.1407035175879397E-4},{"$f":"1/810","v":1.2345679012345679E-3}]
[null,31,3.15,1800.1,1.07,1.3773,1.3757999999999999,1.1599999999999999,1.1579999999999999,null,1.02,1.02,null,null,3.2250000000000001E-2,3.8890000000000001E-2,{"$f":"1/2407","v":4.1545492314083921E-4},{"$f":"1/1392","v":7.1839080459770114E-4},{"$f":"1/3075","v":3.2520325203252032E-4},{"$f":"1/809","v":1.2360939431396785E-3}]
{"$rows_left_out":33}
{"sheet":"ref","index":1,"n_rows":45,"n_cols":4,"rows_kept":45,"cut":false,"hidden":false,"merged":[]}
["限值1","限值0.8","抗震规范(5.2.5)条要求的X向楼层最小剪重比 = 1.60","抗震规范(5.2.5)条要求的Y向楼层最小剪重比 = 1.60"]
[]
[]
[]
[]
[]
[1,0.8,1.6E-2,1.6E-2]
[1,0.8,1.6E-2,1.6E-2]
[1,0.8,1.6E-2,1.6E-2]
[1,0.8,1.6E-2,1.6E-2]
[1,0.8,1.6E-2,1.6E-2]
[1,0.8,1.6E-2,1.6E-2]
[1,0.8,1.6E-2,1.6E-2]
[1,0.8,1.6E-2,1.6E-2]
[1,0.8,1.6E-2,1.6E-2]
{"$rows_left_out":31}
{"sheet":"temp","index":2,"n_rows":47,"n_cols":22,"rows_kept":47,"cut":false,"hidden":false,"merged":[[4,0,25,0],[0,4,0,21],[1,20,1,21],[1,5,1,8],[1,10,1,11],[1,12,1,13],[1,14,1,15],[1,16,1,19]]}
[null,"D:\\N10\\5座\\5座计算0328-2\\5座计算0403 - 减墙加端柱 -加标准层 - lt250\\设计结果",null,null,"YJK结构整体参数速校表 — design by 林霄云 2018.3.31"]
[null,"wmass.out",null,null,"9.质量比","3.刚度比",null,null,null,"6.刚重比","4.受剪承载力比",null,"2.周期比",null,"7.剪重比",null,"5.位移角",null,null,null,"1.位移比"]
[]
[null,null,null,null,null,null,null,"X方向最小刚度比:","Y方向最小刚度比:",null,null,null,null,null,"X向楼层最小剪重比","Y向楼层最小剪重比"]
["说明：\n点击生成按钮，将自动更新非填充区数据，及简易图表，以便于快速查阅。切换目录仅需删除B1单元格数据，注意不要修改工作表名，保存至temp工作表，可以在dif工作表中查看变化",null,null,null,null,null,null,"1.0000(3层1塔)","1.0000(3层1塔)",null,null,null,null,null,1.6E-2,1.6E-2,"  X向最大层间位移角：  1/2164  (15层1塔)","  Y向最大层间位移角：  1/1360  (39层1塔)","  X向最大层间位移角：  1/2374  (39层1塔)","  Y向最大层间位移角：  1/751  (39层1塔)"]
[null,"层号","层高(m)","单位面积质量","g[i]","Ratx1=","Raty1=","Ratx2=","Raty2=","X向刚重比 EJd/GH**2= 7.112","Ratio_X","Ratio_Y","周期","平动系数(X+Y)","X 向剪重比","Y 向剪重比","X方向地震层间位移角","Y方向地震层间位移角","+X 方向风荷载层间位移角","+Y 方向风荷载层间位移角","X方向位移比","Y方向位移比"]
[null,39,4.3499999999999996,1305.83,0.6,1,1,1,1,"Y向刚重比 EJd/GH**2= 4.764",1,1,3.0718999999999999,"1.00(0.00+1.00)",8.4440000000000001E-2,0.13319,{"$f":"1/2666","v":3.7509377344336085E-4},{"$f":"1/1360","v":7.3529411764705881E-4},{"$f":"1/2374","v":4.2122999157540015E-4},{"$f":"1/751","v":1.3315579227696406E-3},1.18,1.03]
[null,38,3.3,2173.0300000000002,1.66,6.0307000000000004,5.2286000000000001,3.5583999999999998,3.0851000000000002,"该结构刚重比EJd/GH**2大于1.4，能够通过《高规》5.4.4条的整体稳定验算",1.75,4.8499999999999996,2.4384999999999999,"0.91(0.91+0.00)",5.9799999999999999E-2,8.2799999999999999E-2,{"$f":"1/2761","v":3.6218761318362912E-4},{"$f":"1/1396","v":7.1633237822349568E-4},{"$f":"1/3474","v":2.878526194588371E-4},{"$f":"1/803","v":1.2453300124533001E-3},1.1599999999999999,1.1100000000000001]
[null,37,3.15,1796.81,1,2.2475999999999998,2.1105,1.6687000000000001,1.5669,"该结构刚重比EJd/GH**2大于2.7，满足《高规》5.4.1，可以不考虑重力二阶效应",1.38,1.02,1.3284,"0.09(0.09+0.00)",5.296E-2,7.22E-2,{"$f":"1/2891","v":3.4590107229332413E-4},{"$f":"1/1398","v":7.1530758226037196E-4},{"$f":"1/3628","v":2.7563395810363837E-4},{"$f":"1/806","v":1.2406947890818859E-3},1.21,1.07]
[null,36,3.15,1796.15,1,1.6984999999999999,1.7342,1.321,1.3489,null,1.02,1.02,0.71,"0.88(0.88+0.00)",4.752E-2,6.3820000000000002E-2,{"$f":"1/2815","v":3.5523978685612787E-4},{"$f":"1/1392","v":7.1839080459770114E-4},{"$f":"1/3555","v":2.8129395218002813E-4},{"$f":"1/805","v":1.2422360248447205E-3}]
[null,35,3.15,1796.15,1,1.5896999999999999,1.6134999999999999,1.2363999999999999,1.2548999999999999,null,1.02,1.02,0.62729999999999997,"1.00(0.00+1.00)",4.2939999999999999E-2,5.6759999999999998E-2,{"$f":"1/2728","v":3.6656891495601173E-4},{"$f":"1/1387","v":7.2098053352559477E-4},{"$f":"1/3471","v":2.8810141169691731E-4},{"$f":"1/803","v":1.2453300124533001E-3}]
[null,34,3.15,1796.15,1,1.5223,1.5528999999999999,1.1973,1.2078,null,1.02,1.02,"X向平动振型参与质量系数总计:",0.94450000000000001,3.918E-2,5.0880000000000002E-2,{"$f":"1/2641","v":3.786444528587656E-4},{"$f":"1/1384","v":7.2254335260115603E-4},{"$f":"1/3376","v":2.9620853080568723E-4},{"$f":"1/802","v":1.2468827930174563E-3}]
[null,33,3.15,1796.15,1,1.4407000000000001,1.4609000000000001,1.179,1.1837,null,1.02,1.02,"Y向平动振型参与质量系数总计:",0.95420000000000005,3.6290000000000003E-2,4.607E-2,{"$f":"1/2560","v":3.9062500000000002E-4},{"$f":"1/1381","v":7.2411296162201298E-4},{"$f":"1/3281","v":3.0478512648582747E-4},{"$f":"1/801","v":1.2484394506866417E-3}]
[null,32,3.15,1796.15,1,1.4014,1.4091,1.1697,1.1698999999999999,null,1.02,1.02,"第1扭转周期(1.3284)/第1平动周期(3.0719)",0.43,3.4119999999999998E-2,4.2130000000000001E-2,{"$f":"1/2489","v":4.017677782241864E-4},{"$f":"1/1381","v":7.2411296162201298E-4},{"$f":"1/3189","v":3.1357792411414236E-4},{"$f":"1/800","v":1.25E-3}]
[null,31,3.15,1796.15,1.07,1.3744000000000001,1.3755999999999999,1.1587000000000001,1.1579999999999999,null,1.03,1.02,null,null,3.236E-2,3.882E-2,{"$f":"1/2411","v":4.1476565740356696E-4},{"$f":"1/1381","v":7.2411296162201298E-4},{"$f":"1/3079","v":3.2478077297823967E-4},{"$f":"1/799","v":1.2515644555694619E-3}]
{"$rows_left_out":33}
{"sheet":"dif","index":3,"n_rows":53,"n_cols":23,"rows_kept":53,"cut":false,"hidden":false,"merged":[[0,4,0,22],[1,5,1,8],[1,10,1,11],[1,12,1,13],[1,14,1,15],[1,16,1,19],[1,20,1,21]]}
[null,null,null,null,"YJK结构整体参数速校表 — design by 林霄云 2018.3.31"]
[null,"wmass.out",null,null,"9.质量比","3.刚度比",null,null,null,"6.刚重比","4.受剪承载力比",null,"2.周期比",null,"7.剪重比",null,"5.位移角",null,null,null,"1.位移比",null,"8.轴压比"]
[null,null,null,null,null,null,null,null,null,null,null,null,null,null,null,null,"注：位移角差值为分母的变化值"]
[]
[]
[null,"层号","层高(m)","单位面积质量","g[i]","Ratx1=","Raty1=","Ratx2=","Raty2=","X向刚重比 EJd/GH**2= 3.269","Ratio_X","Ratio_Y","周期","平动系数(X+Y)","X 向剪重比","Y 向剪重比","X方向地震层间位移角","Y方向地震层间位移角","+X 方向风荷载层间位移角","+Y 方向风荷载层间位移角","X方向位移比","Y方向位移比"]
[null,{"$f":"IF(Sheet1!B7=temp!B7,\"\",Sheet1!B7-temp!B7)","v":""},{"$f":"IF(Sheet1!C7=temp!C7,\"\",Sheet1!C7-temp!C7)","v":""},{"$f":"IF(Sheet1!D7=temp!D7,\"\",Sheet1!D7-temp!D7)","v":""},{"$f":"IF(Sheet1!E7=temp!E7,\"\",Sheet1!E7-temp!E7)","v":""},{"$f":"IF(Sheet1!F7=temp!F7,\"\",Sheet1!F7-temp!F7)","v":""},{"$f":"IF(Sheet1!G7=temp!G7,\"\",Sheet1!G7-temp!G7)","v":""},{"$f":"IF(Sheet1!H7=temp!H7,\"\",Sheet1!H7-temp!H7)","v":""},{"$f":"IF(Sheet1!I7=temp!I7,\"\",Sheet1!I7-temp!I7)","v":""},{"$f":"IF(Sheet1!J7=temp!J7,\"\",Sheet1!J7-temp!J7)","v":{"$error":"#VALUE!"}},{"$f":"IF(Sheet1!K7=temp!K7,\"\",Sheet1!K7-temp!K7)","v":""},{"$f":"IF(Sheet1!L7=temp!L7,\"\",Sheet1!L7-temp!L7)","v":""},{"$f":"IF(Sheet1!M7=temp!M7,\"\",Sheet1!M7-temp!M7)","v":-1.1499999999999844E-2},{"$f":"IF(Sheet1!N7=temp!N7,\"\",Sheet1!N7-temp!N7)","v":""},{"$f":"IF(Sheet1!O7=temp!O7,\"\",Sheet1!O7-temp!O7)","v":-3.999999999999837E-5},{"$f":"IF(Sheet1!P7=temp!P7,\"\",Sheet1!P7-temp!P7)","v":-1.8999999999999573E-4},{"$f":"IF(Sheet1!Q7=temp!Q7,\"\",1/Sheet1!Q7-1/temp!Q7)","v":-2},{"$f":"IF(Sheet1!R7=temp!R7,\"\",1/Sheet1!R7-1/temp!R7)","v":13},{"$f":"IF(Sheet1!S7=temp!S7,\"\",1/Sheet1!S7-1/temp!S7)","v":""},{"$f":"IF(Sheet1!T7=temp!T7,\"\",1/Sheet1!T7-1/temp!T7)","v":9},{"$f":"IF(Sheet1!U7=temp!U7,\"\",Sheet1!U7-temp!U7)","v":1.0000000000000009E-2},{"$f":"IF(Sheet1!V7=temp!V7,\"\",Sheet1!V7-temp!V7)","v":""}]
[null,{"$f":"IF(Sheet1!B8=temp!B8,\"\",Sheet1!B8-temp!B8)","v":""},{"$f":"IF(Sheet1!C8=temp!C8,\"\",Sheet1!C8-temp!C8)","v":""},{"$f":"IF(Sheet1!D8=temp!D8,\"\",Sheet1!D8-temp!D8)","v":""},{"$f":"IF(Sheet1!E8=temp!E8,\"\",Sheet1!E8-temp!E8)","v":""},{"$f":"IF(Sheet1!F8=temp!F8,\"\",Sheet1!F8-temp!F8)","v":-4.8700000000000188E-2},{"$f":"IF(Sheet1!G8=temp!G8,\"\",Sheet1!G8-temp!G8)","v":9.2999999999996419E-3},{"$f":"IF(Sheet1!H8=temp!H8,\"\",Sheet1!H8-temp!H8)","v":-2.8799999999999937E-2},{"$f":"IF(Sheet1!I8=temp!I8,\"\",Sheet1!I8-temp!I8)","v":5.4999999999996163E-3},{"$f":"IF(Sheet1!J8=temp!J8,\"\",Sheet1!J8-temp!J8)","v":""},{"$f":"IF(Sheet1!K8=temp!K8,\"\",Sheet1!K8-temp!K8)","v":""},{"$f":"IF(Sheet1!L8=temp!L8,\"\",Sheet1!L8-temp!L8)","v":""},{"$f":"IF(Sheet1!M8=temp!M8,\"\",Sheet1!M8-temp!M8)","v":7.0000000000014495E-4},{"$f":"IF(Sheet1!N8=temp!N8,\"\",Sheet1!N8-temp!N8)","v":""},{"$f":"IF(Sheet1!O8=temp!O8,\"\",Sheet1!O8-temp!O8)","v":""},{"$f":"IF(Sheet1!P8=temp!P8,\"\",Sheet1!P8-temp!P8)","v":3.999999999999837E-5},{"$f":"IF(Sheet1!Q8=temp!Q8,\"\",1/Sheet1!Q8-1/temp!Q8)","v":-2},{"$f":"IF(Sheet1!R8=temp!R8,\"\",1/Sheet1!R8-1/temp!R8)","v":13},{"$f":"IF(Sheet1!S8=temp!S8,\"\",1/Sheet1!S8-1/temp!S8)","v":-3.9999999999995453},{"$f":"IF(Sheet1!T8=temp!T8,\"\",1/Sheet1!T8-1/temp!T8)","v":10},{"$f":"IF(Sheet1!U8=temp!U8,\"\",Sheet1!U8-temp!U8)","v":""},{"$f":"IF(Sheet1!V8=temp!V8,\"\",Sheet1!V8-temp!V8)","v":-1.0000000000000009E-2}]
[null,{"$f":"IF(Sheet1!B9=temp!B9,\"\",Sheet1!B9-temp!B9)","v":""},{"$f":"IF(Sheet1!C9=temp!C9,\"\",Sheet1!C9-temp!C9)","v":""},{"$f":"IF(Sheet1!D9=temp!D9,\"\",Sheet1!D9-temp!D9)","v":3.9400000000000546},{"$f":"IF(Sheet1!E9=temp!E9,\"\",Sheet1!E9-temp!E9)","v":""},{"$f":"IF(Sheet1!F9=temp!F9,\"\",Sheet1!F9-temp!F9)","v":-1.3900000000000023E-2},{"$f":"IF(Sheet1!G9=temp!G9,\"\",Sheet1!G9-temp!G9)","v":1.5999999999998238E-3},{"$f":"IF(Sheet1!H9=temp!H9,\"\",Sheet1!H9-temp!H9)","v":-1.0399999999999965E-2},{"$f":"IF(Sheet1!I9=temp!I9,\"\",Sheet1!I9-temp!I9)","v":1.2000000000000899E-3},{"$f":"IF(Sheet1!J9=temp!J9,\"\",Sheet1!J9-temp!J9)","v":""},{"$f":"IF(Sheet1!K9=temp!K9,\"\",Sheet1!K9-temp!K9)","v":3.0000000000000027E-2},{"$f":"IF(Sheet1!L9=temp!L9,\"\",Sheet1!L9-temp!L9)","v":""},{"$f":"IF(Sheet1!M9=temp!M9,\"\",Sheet1!M9-temp!M9)","v":-1.5300000000000091E-2},{"$f":"IF(Sheet1!N9=temp!N9,\"\",Sheet1!N9-temp!N9)","v":""},{"$f":"IF(Sheet1!O9=temp!O9,\"\",Sheet1!O9-temp!O9)","v":-1.2000000000000205E-4},{"$f":"IF(Sheet1!P9=temp!P9,\"\",Sheet1!P9-temp!P9)","v":3.0000000000002247E-5},{"$f":"IF(Sheet1!Q9=temp!Q9,\"\",1/Sheet1!Q9-1/temp!Q9)","v":-11},{"$f":"IF(Sheet1!R9=temp!R9,\"\",1/Sheet1!R9-1/temp!R9)","v":13},{"$f":"IF(Sheet1!S9=temp!S9,\"\",1/Sheet1!S9-1/temp!S9)","v":-10},{"$f":"IF(Sheet1!T9=temp!T9,\"\",1/Sheet1!T9-1/temp!T9)","v":10},{"$f":"IF(Sheet1!U9=temp!U9,\"\",Sheet1!U9-temp!U9)","v":""},{"$f":"IF(Sheet1!V9=temp!V9,\"\",Sheet1!V9-temp!V9)","v":""}]
[null,{"$f":"IF(Sheet1!B10=temp!B10,\"\",Sheet1!B10-temp!B10)","v":""},{"$f":"IF(Sheet1!C10=temp!C10,\"\",Sheet1!C10-temp!C10)","v":""},{"$f":"IF(Sheet1!D10=temp!D10,\"\",Sheet1!D10-temp!D10)","v":3.9499999999998181},{"$f":"IF(Sheet1!E10=temp!E10,\"\",Sheet1!E10-temp!E10)","v":""},{"$f":"IF(Sheet1!F10=temp!F10,\"\",Sheet1!F10-temp!F10)","v":-2.0000000000000018E-3},{"$f":"IF(Sheet1!G10=temp!G10,\"\",Sheet1!G10-temp!G10)","v":9.0000000000012292E-4},{"$f":"IF(Sheet1!H10=temp!H10,\"\",Sheet1!H10-temp!H10)","v":-1.5000000000000568E-3},{"$f":"IF(Sheet1!I10=temp!I10,\"\",Sheet1!I10-temp!I10)","v":5.9999999999993392E-4},{"$f":"IF(Sheet1!J10=temp!J10,\"\",Sheet1!J10-temp!J10)","v":""},{"$f":"IF(Sheet1!K10=temp!K10,\"\",Sheet1!K10-temp!K10)","v":""},{"$f":"IF(Sheet1!L10=temp!L10,\"\",Sheet1!L10-temp!L10)","v":""},{"$f":"IF(Sheet1!M10=temp!M10,\"\",Sheet1!M10-temp!M10)","v":-1.1999999999999789E-3},{"$f":"IF(Sheet1!N10=temp!N10,\"\",Sheet1!N10-temp!N10)","v":""},{"$f":"IF(Sheet1!O10=temp!O10,\"\",Sheet1!O10-temp!O10)","v":-1.6000000000000042E-4},{"$f":"IF(Sheet1!P10=temp!P10,\"\",Sheet1!P10-temp!P10)","v":3.999999999999837E-5},{"$f":"IF(Sheet1!Q10=temp!Q10,\"\",1/Sheet1!Q10-1/temp!Q10)","v":-10},{"$f":"IF(Sheet1!R10=temp!R10,\"\",1/Sheet1!R10-1/temp!R10)","v":13},{"$f":"IF(Sheet1!S10=temp!S10,\"\",1/Sheet1!S10-1/temp!S10)","v":-10},{"$f":"IF(Sheet1!T10=temp!T10,\"\",1/Sheet1!T10-1/temp!T10)","v":10},{"$f":"IF(Sheet1!U10=temp!U10,\"\",Sheet1!U10-temp!U10)","v":""},{"$f":"IF(Sheet1!V10=temp!V10,\"\",Sheet1!V10-temp!V10)","v":""}]
[null,{"$f":"IF(Sheet1!B11=temp!B11,\"\",Sheet1!B11-temp!B11)","v":""},{"$f":"IF(Sheet1!C11=temp!C11,\"\",Sheet1!C11-temp!C11)","v":""},{"$f":"IF(Sheet1!D11=temp!D11,\"\",Sheet1!D11-temp!D11)","v":3.9499999999998181},{"$f":"IF(Sheet1!E11=temp!E11,\"\",Sheet1!E11-temp!E11)","v":""},{"$f":"IF(Sheet1!F11=temp!F11,\"\",Sheet1!F11-temp!F11)","v":8.0000000000013394E-4},{"$f":"IF(Sheet1!G11=temp!G11,\"\",Sheet1!G11-temp!G11)","v":6.0000000000015596E-4},{"$f":"IF(Sheet1!H11=temp!H11,\"\",Sheet1!H11-temp!H11)","v":7.0000000000014495E-4},{"$f":"IF(Sheet1!I11=temp!I11,\"\",Sheet1!I11-temp!I11)","v":5.0000000000016698E-4},{"$f":"IF(Sheet1!J11=temp!J11,\"\",Sheet1!J11-temp!J11)","v":""},{"$f":"IF(Sheet1!K11=temp!K11,\"\",Sheet1!K11-temp!K11)","v":""},{"$f":"IF(Sheet1!L11=temp!L11,\"\",Sheet1!L11-temp!L11)","v":""},{"$f":"IF(Sheet1!M11=temp!M11,\"\",Sheet1!M11-temp!M11)","v":-1.6999999999999238E-3},{"$f":"IF(Sheet1!N11=temp!N11,\"\",Sheet1!N11-temp!N11)","v":""},{"$f":"IF(Sheet1!O11=temp!O11,\"\",Sheet1!O11-temp!O11)","v":-1.6000000000000042E-4},{"$f":"IF(Sheet1!P11=temp!P11,\"\",Sheet1!P11-temp!P11)","v":5.0000000000001432E-5},{"$f":"IF(Sheet1!Q11=temp!Q11,\"\",1/Sheet1!Q11-1/temp!Q11)","v":-9},{"$f":"IF(Sheet1!R11=temp!R11,\"\",1/Sheet1!R11-1/temp!R11)","v":13},{"$f":"IF(Sheet1!S11=temp!S11,\"\",1/Sheet1!S11-1/temp!S11)","v":-9},{"$f":"IF(Sheet1!T11=temp!T11,\"\",1/Sheet1!T11-1/temp!T11)","v":10},{"$f":"IF(Sheet1!U11=temp!U11,\"\",Sheet1!U11-temp!U11)","v":""},{"$f":"IF(Sheet1!V11=temp!V11,\"\",Sheet1!V11-temp!V11)","v":""}]
[null,{"$f":"IF(Sheet1!B12=temp!B12,\"\",Sheet1!B12-temp!B12)","v":""},{"$f":"IF(Sheet1!C12=temp!C12,\"\",Sheet1!C12-temp!C12)","v":""},{"$f":"IF(Sheet1!D12=temp!D12,\"\",Sheet1!D12-temp!D12)","v":3.9499999999998181},{"$f":"IF(Sheet1!E12=temp!E12,\"\",Sheet1!E12-temp!E12)","v":""},{"$f":"IF(Sheet1!F12=temp!F12,\"\",Sheet1!F12-temp!F12)","v":1.6000000000000458E-3},{"$f":"IF(Sheet1!G12=temp!G12,\"\",Sheet1!G12-temp!G12)","v":6.0000000000015596E-4},{"$f":"IF(Sheet1!H12=temp!H12,\"\",Sheet1!H12-temp!H12)","v":1.3000000000000789E-3},{"$f":"IF(Sheet1!I12=temp!I12,\"\",Sheet1!I12-temp!I12)","v":3.9999999999995595E-4},{"$f":"IF(Sheet1!J12=temp!J12,\"\",Sheet1!J12-temp!J12)","v":""},{"$f":"IF(Sheet1!K12=temp!K12,\"\",Sheet1!K12-temp!K12)","v":""},{"$f":"IF(Sheet1!L12=temp!L12,\"\",Sheet1!L12-temp!L12)","v":""},{"$f":"IF(Sheet1!M12=temp!M12,\"\",Sheet1!M12-temp!M12)","v":""},{"$f":"IF(Sheet1!N12=temp!N12,\"\",Sheet1!N12-temp!N12)","v":3.1999999999999806E-3},{"$f":"IF(Sheet1!O12=temp!O12,\"\",Sheet1!O12-temp!O12)","v":-1.4000000000000123E-4},{"$f":"IF(Sheet1!P12=temp!P12,\"\",Sheet1!P12-temp!P12)","v":5.9999999999997555E-5},{"$f":"IF(Sheet1!Q12=temp!Q12,\"\",1/Sheet1!Q12-1/temp!Q12)","v":-8},{"$f":"IF(Sheet1!R12=temp!R12,\"\",1/Sheet1!R12-1/temp!R12)","v":12},{"$f":"IF(Sheet1!S12=temp!S12,\"\",1/Sheet1!S12-1/temp!S12)","v":-6.9999999999995453},{"$f":"IF(Sheet1!T12=temp!T12,\"\",1/Sheet1!T12-1/temp!T12)","v":10},{"$f":"IF(Sheet1!U12=temp!U12,\"\",Sheet1!U12-temp!U12)","v":""},{"$f":"IF(Sheet1!V12=temp!V12,\"\",Sheet1!V12-temp!V12)","v":""}]
[null,{"$f":"IF(Sheet1!B13=temp!B13,\"\",Sheet1!B13-temp!B13)","v":""},{"$f":"IF(Sheet1!C13=temp!C13,\"\",Sheet1!C13-temp!C13)","v":""},{"$f":"IF(Sheet1!D13=temp!D13,\"\",Sheet1!D13-temp!D13)","v":3.9499999999998181},{"$f":"IF(Sheet1!E13=temp!E13,\"\",Sheet1!E13-temp!E13)","v":""},{"$f":"IF(Sheet1!F13=temp!F13,\"\",Sheet1!F13-temp!F13)","v":2.6999999999999247E-3},{"$f":"IF(Sheet1!G13=temp!G13,\"\",Sheet1!G13-temp!G13)","v":8.9999999999990088E-4},{"$f":"IF(Sheet1!H13=temp!H13,\"\",Sheet1!H13-temp!H13)","v":1.1999999999998678E-3},{"$f":"IF(Sheet1!I13=temp!I13,\"\",Sheet1!I13-temp!I13)","v":2.9999999999996696E-4},{"$f":"IF(Sheet1!J13=temp!J13,\"\",Sheet1!J13-temp!J13)","v":""},{"$f":"IF(Sheet1!K13=temp!K13,\"\",Sheet1!K13-temp!K13)","v":""},{"$f":"IF(Sheet1!L13=temp!L13,\"\",Sheet1!L13-temp!L13)","v":""},{"$f":"IF(Sheet1!M13=temp!M13,\"\",Sheet1!M13-temp!M13)","v":""},{"$f":"IF(Sheet1!N13=temp!N13,\"\",Sheet1!N13-temp!N13)","v":9.9999999999988987E-5},{"$f":"IF(Sheet1!O13=temp!O13,\"\",Sheet1!O13-temp!O13)","v":-1.4000000000000123E-4},{"$f":"IF(Sheet1!P13=temp!P13,\"\",Sheet1!P13-temp!P13)","v":7.0000000000000617E-5},{"$f":"IF(Sheet1!Q13=temp!Q13,\"\",1/Sheet1!Q13-1/temp!Q13)","v":-6},{"$f":"IF(Sheet1!R13=temp!R13,\"\",1/Sheet1!R13-1/temp!R13)","v":13},{"$f":"IF(Sheet1!S13=temp!S13,\"\",1/Sheet1!S13-1/temp!S13)","v":-6},{"$f":"IF(Sheet1!T13=temp!T13,\"\",1/Sheet1!T13-1/temp!T13)","v":10},{"$f":"IF(Sheet1!U13=temp!U13,\"\",Sheet1!U13-temp!U13)","v":""},{"$f":"IF(Sheet1!V13=temp!V13,\"\",Sheet1!V13-temp!V13)","v":""}]
[null,{"$f":"IF(Sheet1!B14=temp!B14,\"\",Sheet1!B14-temp!B14)","v":""},{"$f":"IF(Sheet1!C14=temp!C14,\"\",Sheet1!C14-temp!C14)","v":""},{"$f":"IF(Sheet1!D14=temp!D14,\"\",Sheet1!D14-temp!D14)","v":3.9499999999998181},{"$f":"IF(Sheet1!E14=temp!E14,\"\",Sheet1!E14-temp!E14)","v":""},{"$f":"IF(Sheet1!F14=temp!F14,\"\",Sheet1!F14-temp!F14)","v":2.5999999999999357E-3},{"$f":"IF(Sheet1!G14=temp!G14,\"\",Sheet1!G14-temp!G14)","v":4.9999999999994493E-4},{"$f":"IF(Sheet1!H14=temp!H14,\"\",Sheet1!H14-temp!H14)","v":1.1000000000001009E-3},{"$f":"IF(Sheet1!I14=temp!I14,\"\",Sheet1!I14-temp!I14)","v":1.9999999999997797E-4},{"$f":"IF(Sheet1!J14=temp!J14,\"\",Sheet1!J14-temp!J14)","v":""},{"$f":"IF(Sheet1!K14=temp!K14,\"\",Sheet1!K14-temp!K14)","v":""},{"$f":"IF(Sheet1!L14=temp!L14,\"\",Sheet1!L14-temp!L14)","v":""},{"$f":"IF(Sheet1!M14=temp!M14,\"\",Sheet1!M14-temp!M14)","v":{"$error":"#VALUE!"}},{"$f":"IF(Sheet1!N14=temp!N14,\"\",Sheet1!N14-temp!N14)","v":""},{"$f":"IF(Sheet1!O14=temp!O14,\"\",Sheet1!O14-temp!O14)","v":-1.2999999999999817E-4},{"$f":"IF(Sheet1!P14=temp!P14,\"\",Sheet1!P14-temp!P14)","v":7.0000000000000617E-5},{"$f":"IF(Sheet1!Q14=temp!Q14,\"\",1/Sheet1!Q14-1/temp!Q14)","v":-5},{"$f":"IF(Sheet1!R14=temp!R14,\"\",1/Sheet1!R14-1/temp!R14)","v":12},{"$f":"IF(Sheet1!S14=temp!S14,\"\",1/Sheet1!S14-1/temp!S14)","v":-5},{"$f":"IF(Sheet1!T14=temp!T14,\"\",1/Sheet1!T14-1/temp!T14)","v":10},{"$f":"IF(Sheet1!U14=temp!U14,\"\",Sheet1!U14-temp!U14)","v":""},{"$f":"IF(Sheet1!V14=temp!V14,\"\",Sheet1!V14-temp!V14)","v":""}]
[null,{"$f":"IF(Sheet1!B15=temp!B15,\"\",Sheet1!B15-temp!B15)","v":""},{"$f":"IF(Sheet1!C15=temp!C15,\"\",Sheet1!C15-temp!C15)","v":""},{"$f":"IF(Sheet1!D15=temp!D15,\"\",Sheet1!D15-temp!D15)","v":3.9499999999998181},{"$f":"IF(Sheet1!E15=temp!E15,\"\",Sheet1!E15-temp!E15)","v":""},{"$f":"IF(Sheet1!F15=temp!F15,\"\",Sheet1!F15-temp!F15)","v":2.8999999999999027E-3},{"$f":"IF(Sheet1!G15=temp!G15,\"\",Sheet1!G15-temp!G15)","v":1.9999999999997797E-4},{"$f":"IF(Sheet1!H15=temp!H15,\"\",Sheet1!H15-temp!H15)","v":1.2999999999998568E-3},{"$f":"IF(Sheet1!I15=temp!I15,\"\",Sheet1!I15-temp!I15)","v":""},{"$f":"IF(Sheet1!J15=temp!J15,\"\",Sheet1!J15-temp!J15)","v":""},{"$f":"IF(Sheet1!K15=temp!K15,\"\",Sheet1!K15-temp!K15)","v":-1.0000000000000009E-2},{"$f":"IF(Sheet1!L15=temp!L15,\"\",Sheet1!L15-temp!L15)","v":""},{"$f":"IF(Sheet1!M15=temp!M15,\"\",Sheet1!M15-temp!M15)","v":""},{"$f":"IF(Sheet1!N15=temp!N15,\"\",Sheet1!N15-temp!N15)","v":""},{"$f":"IF(Sheet1!O15=temp!O15,\"\",Sheet1!O15-temp!O15)","v":-1.0999999999999899E-4},{"$f":"IF(Sheet1!P15=temp!P15,\"\",Sheet1!P15-temp!P15)","v":7.0000000000000617E-5},{"$f":"IF(Sheet1!Q15=temp!Q15,\"\",1/Sheet1!Q15-1/temp!Q15)","v":-4},{"$f":"IF(Sheet1!R15=temp!R15,\"\",1/Sheet1!R15-1/temp!R15)","v":11},{"$f":"IF(Sheet1!S15=temp!S15,\"\",1/Sheet1!S15-1/temp!S15)","v":-4},{"$f":"IF(Sheet1!T15=temp!T15,\"\",1/Sheet1!T15-1/temp!T15)","v":10.000000000000114},{"$f":"IF(Sheet1!U15=temp!U15,\"\",Sheet1!U15-temp!U15)","v":""},{"$f":"IF(Sheet1!V15=temp!V15,\"\",Sheet1!V15-temp!V15)","v":""}]
{"$rows_left_out":38}